Target
Gag-Pol polyprotein [489-587]
Ligand
BDBM50004779
Substrate
Meas. Tech.
ChEBML_79800
IC50
>200000±n/a nM
Citation
 DeCamp, DLBabé, LMSalto, RLucich, JLKoo, MSKahl, SBCraik, CS Specific inhibition of HIV-1 protease by boronated porphyrins. J Med Chem 35:3426-8 (1992)  
Target
Name:
Gag-Pol polyprotein [489-587]
Synonyms:
Human immunodeficiency virus type 1 protease Pol polyprotein | gag-pol
Type:
Enzyme Subunit
Mol. Mass.:
10781.16
Organism:
Human immunodeficiency virus type 1
Description:
P04585[489-587]
Residue:
99
  
Inhibitor
Name:
BDBM50004779
Synonyms:
3-[(1Z,4Z,9Z,15Z)-18-(2-Carboxy-ethyl)-8,13-bis-(1,2-dihydroxy-ethyl)-3,7,12,17-tetramethyl-porphyrin-2-yl]-propionic acid CHEMBL12659
Type:
Small organic molecule
Emp. Form.:
C34H38N4O8
Mol. Mass.:
630.6875
SMILES:
Cc1c(CCC(O)=O)c2cc3[nH]c(cc4[nH]c(cc5nc(cc1n2)c(C)c5C(O)CO)c(C)c4C(O)CO)c(C)c3CCC(O)=O
: