Target
Pol polyprotein
Ligand
BDBM51757
Substrate
Meas. Tech.
ChEBML_159124
IC50
500000±n/a nM
Citation
 DeCamp, DLBabé, LMSalto, RLucich, JLKoo, MSKahl, SBCraik, CS Specific inhibition of HIV-1 protease by boronated porphyrins. J Med Chem 35:3426-8 (1992)  
Target
Name:
Pol polyprotein
Synonyms:
Human immunodeficiency virus type 2 pol protein
Type:
PROTEIN
Mol. Mass.:
100453.78
Organism:
Human immunodeficiency virus 2
Description:
ChEMBL_159124
Residue:
876
  
Inhibitor
Name:
BDBM51757
Synonyms:
3-[(1Z,4Z,9Z,15Z)-18-(2-Carboxy-ethyl)-3,7,12,17-tetramethyl-8,13-divinyl-porphyrin-2-yl]-propionic acid 3-[18-(2-carboxyethyl)-8,13-bis(ethenyl)-3,7,12,17-tetramethyl-22,23-dihydroporphyrin-2-yl]propanoic acid CHEMBL267548 PROTOPORPHYRIN IX cid_4971
Type:
Small organic molecule
Emp. Form.:
C34H34N4O4
Mol. Mass.:
562.6582
SMILES:
Cc1c(CCC(O)=O)c2cc3nc(cc4[nH]c(cc5[nH]c(cc1n2)c(C)c5C=C)c(C)c4C=C)c(C)c3CCC(O)=O
: