Target
Pol polyprotein
Ligand
BDBM50004781
Substrate
Meas. Tech.
ChEBML_159124
IC50
2200±n/a nM
Citation
 DeCamp, DLBabé, LMSalto, RLucich, JLKoo, MSKahl, SBCraik, CS Specific inhibition of HIV-1 protease by boronated porphyrins. J Med Chem 35:3426-8 (1992)  
Target
Name:
Pol polyprotein
Synonyms:
Human immunodeficiency virus type 2 pol protein
Type:
PROTEIN
Mol. Mass.:
100453.78
Organism:
Human immunodeficiency virus 2
Description:
ChEMBL_159124
Residue:
876
  
Inhibitor
Name:
BDBM50004781
Synonyms:
3-[18-(2-Carboxy-ethyl)-8,13-bis-(1,2-diacetoxy-ethyl)-3,7,12,17-tetramethyl-22,24-dihydro-porphin-2-yl]-propionic acid;Cu complex | CHEMBL326715
Type:
Small organic molecule
Emp. Form.:
C50H44CuN4O12
Mol. Mass.:
956.45
SMILES:
CC1=C(CCC(O)=O)\C2=C\c3c(CCC(O)=O)c(C)c4\C=C5/N=C(/C=c6/c(C(COC(=O)C7=CC7)OC(=O)C7=CC7)c(C)\c(=C\C1=N2)n6[Cu]n34)C(C)=C5C(COC(=O)C1=CC1)OC(=O)C1=CC1
: