Target
Adenosine receptor A1
Ligand
BDBM50455640
Substrate
Meas. Tech.
ChEBML_217926
Ki
232±n/a nM
Citation
 Matsuda, AShinozaki, MYamaguchi, THomma, HNomoto, RMiyasaka, TWatanabe, YAbiru, T Nucleosides and nucleotides. 103. 2-Alkynyladenosines: a novel class of selective adenosine A2 receptor agonists with potent antihypertensive effects. J Med Chem 35:241-52 (1992)  
Target
Name:
Adenosine receptor A1
Synonyms:
AA1R_RAT ADENOSINE A1 high Adenosine A1 receptor (A1) Adenosine receptors A1 | Adora1
Type:
Protein
Mol. Mass.:
36704.13
Organism:
Rattus norvegicus (rat)
Description:
Residue:
326
  
Inhibitor
Name:
BDBM50455640
Synonyms:
CHEMBL2113515
Type:
Small organic molecule
Emp. Form.:
C20H29N5O4
Mol. Mass.:
403.4754
SMILES:
CCCCCCCCC#Cc1nc(N)c2ncn([C@@H]3O[C@H](CO)[C@@H](O)[C@H]3O)c2n1
: