Target
Adenosine receptor A1
Ligand
BDBM50368402
Substrate
Meas. Tech.
ChEMBL_217926 (CHEMBL823656)
Ki
267±n/a nM
Citation
 Matsuda, AShinozaki, MYamaguchi, THomma, HNomoto, RMiyasaka, TWatanabe, YAbiru, T Nucleosides and nucleotides. 103. 2-Alkynyladenosines: a novel class of selective adenosine A2 receptor agonists with potent antihypertensive effects. J Med Chem 35:241-52 (1992)  
Target
Name:
Adenosine receptor A1
Synonyms:
AA1R_RAT ADENOSINE A1 high Adenosine A1 receptor (A1) Adenosine receptors A1 | Adora1
Type:
Protein
Mol. Mass.:
36704.13
Organism:
Rattus norvegicus (rat)
Description:
Residue:
326
  
Inhibitor
Name:
BDBM50368402
Synonyms:
CHEMBL608905
Type:
Small organic molecule
Emp. Form.:
C22H33N5O4
Mol. Mass.:
431.5285
SMILES:
CCCCCCCCCCC#Cc1nc(N)c2ncn(C3O[C@H](CO)[C@@H](O)[C@H]3O)c2n1
: