Target
Substance-P receptor
Ligand
BDBM50002390
Substrate
Meas. Tech.
ChEMBL_208658 (CHEMBL813318)
IC50
180±n/a nM
Citation
 Venepalli, BRAimone, LDAppell, KCBell, MRDority, JAGoswami, RHall, PLKumar, VLawrence, KBLogan, ME Synthesis and substance P receptor binding activity of androstano[3,2-b]pyrimido[1,2-a]benzimidazoles. J Med Chem 35:374-8 (1992)  
Target
Name:
Substance-P receptor
Synonyms:
NK-1 receptor NK1 Receptor Neurokinin 1 receptor SPR Tac1r Tacr1
Type:
G Protein-Coupled Receptor (GPCR)
Mol. Mass.:
46371.54
Organism:
Rattus norvegicus (rat)
Description:
Competition binding assays were carried out using membrane preparations from transfected CHO cells that constitutively expressed the rat NK1 receptor.
Residue:
407
  
Inhibitor
Name:
BDBM50002390
Synonyms:
15a,17a-dimethyl-1-(1-propynyl)-(1R,15aS,17aS)-2,3,3a,3b,4,5,5a,6,15,15a,15b,16,17,17a-tetradecahydro-1H-benzo[4,5]imidazo[2,1-b]cyclopenta[5,6]naphtho[1,2-g]quinazolin-1-ol(0.1MH2O) | CHEMBL124532
Type:
Small organic molecule
Emp. Form.:
C30H35N3O
Mol. Mass.:
453.6184
SMILES:
CC#C[C@]1(O)CCC2C3CCC4Cc5nc6nc7ccccc7n6cc5C[C@]4(C)C3CC[C@]12C
: