Target
Prostaglandin G/H synthase 1/2
Ligand
BDBM50003117
Substrate
Meas. Tech.
ChEBML_158130
IC50
50±n/a nM
Citation
 Unangst, PCShrum, GPConnor, DTDyer, RDSchrier, DJ Novel 1,2,4-oxadiazoles and 1,2,4-thiadiazoles as dual 5-lipoxygenase and cyclooxygenase inhibitors. J Med Chem 35:3691-8 (1992)  
Target
Name:
Prostaglandin G/H synthase 1/2
Synonyms:
Cyclooxygenase
Type:
Mol. Mass.:
Description:
ASSAY_ID of ChEMBL is 1666355
Components:
This complex has 2 components.
Component 1
Name:
Prostaglandin G/H synthase 2
Synonyms:
Cox-2 Cyclooxygenase Ptgs2
Type:
Enzyme Catalytic Domain
Mol. Mass.:
69173.51
Organism:
RAT
Description:
COX-2 0 RAT::P35355
Residue:
604
  
Component 2
Name:
Prostaglandin G/H synthase 1
Synonyms:
Cox-1 Cyclooxygenase PGH1_RAT Ptgs1
Type:
Enzyme Catalytic Domain
Mol. Mass.:
69033.56
Organism:
RAT
Description:
COX-1 0 RAT::Q63921
Residue:
602
  
Inhibitor
Name:
BDBM50003117
Synonyms:
3-(3,5-Di-tert-butyl-4-hydroxy-phenyl)-4H-[1,2,4]oxadiazole-5-thione | CHEMBL331489
Type:
Small organic molecule
Emp. Form.:
C16H22N2O2S
Mol. Mass.:
306.423
SMILES:
CC(C)(C)c1cc(cc(c1O)C(C)(C)C)-c1nc(=S)o[nH]1
: