Target
Polyunsaturated fatty acid 5-lipoxygenase
Ligand
BDBM50003112
Substrate
Meas. Tech.
ChEBML_3898
IC50
1500±n/a nM
Citation
 Unangst, PCShrum, GPConnor, DTDyer, RDSchrier, DJ Novel 1,2,4-oxadiazoles and 1,2,4-thiadiazoles as dual 5-lipoxygenase and cyclooxygenase inhibitors. J Med Chem 35:3691-8 (1992)  
Target
Name:
Polyunsaturated fatty acid 5-lipoxygenase
Synonyms:
Alox5 LOX5_RAT
Type:
PROTEIN
Mol. Mass.:
78082.31
Organism:
Rattus norvegicus
Description:
ChEMBL_1432947
Residue:
673
  
Inhibitor
Name:
BDBM50003112
Synonyms:
CHEMBL123210 | N-[5-(3,5-Di-tert-butyl-4-hydroxy-phenyl)-[1,2,4]oxadiazol-3-yl]-formimidic acid ethyl ester
Type:
Small organic molecule
Emp. Form.:
C19H27N3O3
Mol. Mass.:
345.436
SMILES:
CCO\C=N\c1noc(n1)-c1cc(c(O)c(c1)C(C)(C)C)C(C)(C)C
: