Target
Polyunsaturated fatty acid 5-lipoxygenase
Ligand
BDBM50075539
Substrate
Meas. Tech.
ChEBML_3898
IC50
1900±n/a nM
Citation
 Unangst, PCShrum, GPConnor, DTDyer, RDSchrier, DJ Novel 1,2,4-oxadiazoles and 1,2,4-thiadiazoles as dual 5-lipoxygenase and cyclooxygenase inhibitors. J Med Chem 35:3691-8 (1992)  
Target
Name:
Polyunsaturated fatty acid 5-lipoxygenase
Synonyms:
Alox5 LOX5_RAT
Type:
PROTEIN
Mol. Mass.:
78082.31
Organism:
Rattus norvegicus
Description:
ChEMBL_1432947
Residue:
673
  
Inhibitor
Name:
BDBM50075539
Synonyms:
3-(3,5-Di-tert-butyl-4-hydroxy-phenyl)-[1,2,4]thiadiazol-5-yl-cyanamide CHEMBL17229
Type:
Small organic molecule
Emp. Form.:
C17H22N4OS
Mol. Mass.:
330.448
SMILES:
CC(C)(C)c1cc(cc(c1O)C(C)(C)C)-c1nsc(NC#N)n1
: