Target
Polyunsaturated fatty acid 5-lipoxygenase
Ligand
BDBM50003126
Substrate
Meas. Tech.
ChEMBL_3898 (CHEMBL619903)
IC50
330±n/a nM
Citation
 Unangst, PCShrum, GPConnor, DTDyer, RDSchrier, DJ Novel 1,2,4-oxadiazoles and 1,2,4-thiadiazoles as dual 5-lipoxygenase and cyclooxygenase inhibitors. J Med Chem 35:3691-8 (1992)  
Target
Name:
Polyunsaturated fatty acid 5-lipoxygenase
Synonyms:
Alox5 LOX5_RAT
Type:
PROTEIN
Mol. Mass.:
78082.31
Organism:
Rattus norvegicus
Description:
ChEMBL_1432947
Residue:
673
  
Inhibitor
Name:
BDBM50003126
Synonyms:
4-(5-Amino-[1,2,4]thiadiazol-3-yl)-2,6-di-tert-butyl-phenol | CHEMBL17091
Type:
Small organic molecule
Emp. Form.:
C16H23N3OS
Mol. Mass.:
305.438
SMILES:
CC(C)(C)c1cc(cc(c1O)C(C)(C)C)-c1nsc(N)n1
: