Target
Amine oxidase [flavin-containing] A/B
Ligand
BDBM15579
Substrate
Meas. Tech.
ChEBML_122631
IC50
280±n/a nM
Citation
 Yu, PHDavis, BABoulton, AA Aliphatic propargylamines: potent, selective, irreversible monoamine oxidase B inhibitors. J Med Chem 35:3705-13 (1992)  
Target
Name:
Amine oxidase [flavin-containing] A/B
Synonyms:
Monoamine oxidase
Type:
Mol. Mass.:
Description:
ASSAY_ID of ChEMBL is 122635
Components:
This complex has 2 components.
Component 1
Name:
Amine oxidase [flavin-containing] B
Synonyms:
AOFB_RAT Amine oxidase [flavin-containing] B Monoamine Oxidase Type B (MAO-B) Monoamine oxidase B (MAO-B) Monoamine oxidase type B (MAOB) | Monoamine oxidase-B (MAO-B)
Type:
Enzyme
Mol. Mass.:
58469.65
Organism:
Rattus norvegicus (rat)
Description:
P19643
Residue:
520
  
Component 2
Name:
Amine oxidase [flavin-containing] A
Synonyms:
AOFA_RAT Amine oxidase [flavin-containing] A Monoamine Oxidase Type A (MAO-A) Monoamine oxidase A (MAO-A) Monoamine oxidase type A (MAOA)
Type:
Enzyme
Mol. Mass.:
59515.21
Organism:
Rattus norvegicus (rat)
Description:
Residue:
526
  
Inhibitor
Name:
BDBM15579
Synonyms:
CHEMBL972 L-Deprenyl SLG US8633208, Deprenyl methyl[(2R)-1-phenylpropan-2-yl]prop-2-yn-1-ylamine
Type:
Small organic molecule
Emp. Form.:
C13H17N
Mol. Mass.:
187.2808
SMILES:
C[C@H](Cc1ccccc1)N(C)CC#C
: