Target
Neutrophil elastase
Ligand
BDBM50003159
Substrate
Meas. Tech.
ChEMBL_63662 (CHEMBL675718)
IC50
2000±n/a nM
Citation
 Finke, PEShah, SKAshe, BMBall, RGBlacklock, TJBonney, RJBrause, KAChandler, GOCotton, MDavies, P Inhibition of human leukocyte elastase. 4. Selection of a substituted cephalosporin (L-658,758) as a topical aerosol. J Med Chem 35:3731-44 (1992)  
Target
Name:
Neutrophil elastase
Synonyms:
Bone marrow serine protease Coagulation factor X ELANE Elastase HLE Leukocyte elastase Medullasin Neutrophil elastase (HNE) PMN elastase Trypsin
Type:
Enzyme
Mol. Mass.:
28532.38
Organism:
Homo sapiens (Human)
Description:
P08246
Residue:
267
  
Inhibitor
Name:
BDBM50003159
Synonyms:
3-(6-Hydroxy-2-methyl-5-oxo-2,5-dihydro-[1,2,4]triazin-3-ylsulfanylmethyl)-7-methoxy-5,5-dioxo-2-(pyrrolidine-1-carbonyl)-5lambda*6*-thia-1-aza-bicyclo[4.2.0]oct-2-en-8-one | CHEMBL123153
Type:
Small organic molecule
Emp. Form.:
C17H21N5O7S2
Mol. Mass.:
471.508
SMILES:
CO[C@@H]1[C@@H]2N(C1=O)C(C(=O)N1CCCC1)=C(CSc1nc(=O)c(=O)[nH]n1C)CS2(=O)=O
: