Target
Neutrophil elastase
Ligand
BDBM50368407
Substrate
Meas. Tech.
ChEMBL_63995 (CHEMBL673104)
Ki
1700±n/a nM
Citation
 Finke, PEShah, SKAshe, BMBall, RGBlacklock, TJBonney, RJBrause, KAChandler, GOCotton, MDavies, P Inhibition of human leukocyte elastase. 4. Selection of a substituted cephalosporin (L-658,758) as a topical aerosol. J Med Chem 35:3731-44 (1992)  
Target
Name:
Neutrophil elastase
Synonyms:
Bone marrow serine protease Coagulation factor X ELANE Elastase HLE Leukocyte elastase Medullasin Neutrophil elastase (HNE) PMN elastase Trypsin
Type:
Enzyme
Mol. Mass.:
28532.38
Organism:
Homo sapiens (Human)
Description:
P08246
Residue:
267
  
Inhibitor
Name:
BDBM50368407
Synonyms:
CHEMBL446371 | L-658758
Type:
Small organic molecule
Emp. Form.:
C16H20N2O9S
Mol. Mass.:
416.403
SMILES:
CO[C@@H]1[C@@H]2N(C1=O)C(C(=O)N1CCC[C@H]1C(O)=O)=C(COC(C)=O)CS2(=O)=O
: