Target
Renin
Ligand
BDBM50003171
Substrate
Meas. Tech.
ChEMBL_195749 (CHEMBL801600)
pH
7.4±n/a
IC50
7.00±n/a nM
Comments
extracted
Citation
 Weber, AESteiner, MGKrieter, PAColletti, AETata, JRHalgren, TABall, RGDoyle, JJSchorn, TWStearns, RA Highly potent, orally active diester macrocyclic human renin inhibitors. J Med Chem 35:3755-73 (1992)  
Target
Name:
Renin
Synonyms:
Angiotensinogenase RENI_HUMAN
Type:
Enzyme
Mol. Mass.:
45058.99
Organism:
Homo sapiens (Human)
Description:
Residue:
406
  
Inhibitor
Name:
BDBM50003171
Synonyms:
(diastereomer-1) [1-(6-Cyclohexylmethyl-10-diethylaminomethyl-7-hydroxy-4,8,14-trioxo-1,9-dioxa-5-aza-cyclotetradec-3-ylcarbamoyl)-2-phenyl-ethyl]-carbamic acid tert-butyl ester CHEMBL431667
Type:
Small organic molecule
Emp. Form.:
C37H58N4O9
Mol. Mass.:
702.8778
SMILES:
CCN(CC)CC1CCCC(=O)OC[C@H](NC(=O)C(Cc2ccccc2)NC(=O)OC(C)(C)C)C(=O)N[C@@H](CC2CCCCC2)[C@@H](O)C(=O)O1
: