Target
Renin
Ligand
BDBM50003174
Substrate
Meas. Tech.
ChEBML_195749
pH
7.4±n/a
IC50
0.500000±n/a nM
Comments
extracted
Citation
 Weber, AESteiner, MGKrieter, PAColletti, AETata, JRHalgren, TABall, RGDoyle, JJSchorn, TWStearns, RA Highly potent, orally active diester macrocyclic human renin inhibitors. J Med Chem 35:3755-73 (1992)  
Target
Name:
Renin
Synonyms:
Angiotensinogenase RENI_HUMAN
Type:
Enzyme
Mol. Mass.:
45058.99
Organism:
Homo sapiens (Human)
Description:
Residue:
406
  
Inhibitor
Name:
BDBM50003174
Synonyms:
CHEMBL339289 | {2-[1-(6-Cyclohexylmethyl-7-hydroxy-10-morpholin-4-ylmethyl-4,8,14-trioxo-1,9-dioxa-5-aza-cyclotetradec-3-ylcarbamoyl)-2-phenyl-ethylcarbamoyl]-1,1-dimethyl-ethyl}-carbamic acid tert-butyl ester
Type:
Small organic molecule
Emp. Form.:
C42H65N5O11
Mol. Mass.:
815.9924
SMILES:
CC(C)(C)OC(=O)NC(C)(C)CC(=O)N[C@@H](Cc1ccccc1)C(=O)N[C@H]1COC(=O)CCC[C@H](CN2CCOCC2)OC(=O)[C@H](O)[C@H](CC2CCCCC2)NC1=O
: