Target
Renin
Ligand
BDBM50003192
Substrate
Meas. Tech.
ChEBML_195749
pH
7.4±n/a
IC50
1.3±n/a nM
Comments
extracted
Citation
 Weber, AESteiner, MGKrieter, PAColletti, AETata, JRHalgren, TABall, RGDoyle, JJSchorn, TWStearns, RA Highly potent, orally active diester macrocyclic human renin inhibitors. J Med Chem 35:3755-73 (1992)  
Target
Name:
Renin
Synonyms:
Angiotensinogenase RENI_HUMAN
Type:
Enzyme
Mol. Mass.:
45058.99
Organism:
Homo sapiens (Human)
Description:
Residue:
406
  
Inhibitor
Name:
BDBM50003192
Synonyms:
2-(1-Aza-bicyclo[2.2.2]oct-3-ylamino)-N-(6-cyclohexylmethyl-7-hydroxy-10-morpholin-4-ylmethyl-4,8,14-trioxo-1,9-dioxa-5-aza-cyclotetradec-3-yl)-3-phenyl-propionamide | CHEMBL122437
Type:
Small organic molecule
Emp. Form.:
C39H59N5O8
Mol. Mass.:
725.9145
SMILES:
O[C@@H]1[C@H](CC2CCCCC2)NC(=O)[C@H](COC(=O)CCC[C@H](CN2CCOCC2)OC1=O)NC(=O)[C@H](Cc1ccccc1)NC1CN2CCC1CC2
: