Target
Renin
Ligand
BDBM50003178
Substrate
Meas. Tech.
ChEBML_195749
pH
7.4±n/a
IC50
600±n/a nM
Comments
extracted
Citation
 Weber, AESteiner, MGKrieter, PAColletti, AETata, JRHalgren, TABall, RGDoyle, JJSchorn, TWStearns, RA Highly potent, orally active diester macrocyclic human renin inhibitors. J Med Chem 35:3755-73 (1992)  
Target
Name:
Renin
Synonyms:
Angiotensinogenase RENI_HUMAN
Type:
Enzyme
Mol. Mass.:
45058.99
Organism:
Homo sapiens (Human)
Description:
Residue:
406
  
Inhibitor
Name:
BDBM50003178
Synonyms:
(diastereomer-1)[1-(3-Butyl-7-cyclohexylmethyl-6-hydroxy-5,9,13-trioxo-1,4-dioxa-8-aza-cyclotridec-10-ylcarbamoyl)-2-phenyl-ethyl]-carbamic acid tert-butyl ester CHEMBL279862
Type:
Small organic molecule
Emp. Form.:
C35H53N3O9
Mol. Mass.:
659.81
SMILES:
CCCCC1COC(=O)CC[C@H](NC(=O)C(Cc2ccccc2)NC(=O)OC(C)(C)C)C(=O)N[C@@H](CC2CCCCC2)[C@@H](O)C(=O)O1
: