Target
Gag-Pol polyprotein [489-587]
Ligand
BDBM50368416
Substrate
Meas. Tech.
ChEBML_157563
Ki
1.5±n/a nM
Citation
 Rich, DHPrasad, JVSun, CQGreen, JMueller, RHouseman, KMacKenzie, DMalkovsky, M New hydroxyethylamine HIV protease inhibitors that suppress viral replication. J Med Chem 35:3803-12 (1992)  
Target
Name:
Gag-Pol polyprotein [489-587]
Synonyms:
Human immunodeficiency virus type 1 protease Pol polyprotein | gag-pol
Type:
Enzyme Subunit
Mol. Mass.:
10781.16
Organism:
Human immunodeficiency virus type 1
Description:
P04585[489-587]
Residue:
99
  
Inhibitor
Name:
BDBM50368416
Synonyms:
CHEMBL1790876 | CHEMBL3349487
Type:
Small organic molecule
Emp. Form.:
C43H57N7O8
Mol. Mass.:
799.9548
SMILES:
[H][C@@](O)(CN1CCCC1C(=O)N[C@@H]([C@@H](C)CC)C(=O)N[C@@H](Cc1ccccc1)C(=O)NC)[C@H](Cc1ccccc1)NC(=O)[C@H](CC(N)=O)NC(=O)OCc1ccccc1
: