Target
Carbonic anhydrase 2
Ligand
BDBM50003246
Substrate
Meas. Tech.
ChEMBL_45064 (CHEMBL659847)
Ki
2.34±n/a nM
Citation
 Hartman, GDHalczenko, WSmith, RLSugrue, MFMallorga, PJMichelson, SRRandall, WCSchwam, HSondey, JM 4-substituted thiophene- and furan-2-sulfonamides as topical carbonic anhydrase inhibitors. J Med Chem 35:3822-31 (1992)  
Target
Name:
Carbonic anhydrase 2
Synonyms:
CA-II CAC Carbonate dehydratase II Carbonic anhydrase 2 (CA-II) Carbonic anhydrase C Carbonic anhydrase II (CA-II) Carbonic anhydrase II (hCA II) | Carbonic anhydrase isoenzyme II (hCA II)
Type:
Enzyme
Mol. Mass.:
29250.71
Organism:
Homo sapiens (Human)
Description:
P00918
Residue:
260
  
Inhibitor
Name:
BDBM50003246
Synonyms:
4-(3-Dimethylaminomethyl-4-hydroxy-benzenesulfonyl)-furan-2-sulfonic acid amide; hydrochloride | CHEMBL553909
Type:
Small organic molecule
Emp. Form.:
C13H16N2O6S2
Mol. Mass.:
360.406
SMILES:
CN(C)Cc1cc(ccc1O)S(=O)(=O)c1coc(c1)S(N)(=O)=O
: