Target
Carbonic anhydrase 2
Ligand
BDBM50003247
Substrate
Meas. Tech.
ChEBML_45064
Ki
3.3±n/a nM
Citation
 Hartman, GDHalczenko, WSmith, RLSugrue, MFMallorga, PJMichelson, SRRandall, WCSchwam, HSondey, JM 4-substituted thiophene- and furan-2-sulfonamides as topical carbonic anhydrase inhibitors. J Med Chem 35:3822-31 (1992)  
Target
Name:
Carbonic anhydrase 2
Synonyms:
CA-II CAC Carbonate dehydratase II Carbonic anhydrase 2 (CA-II) Carbonic anhydrase C Carbonic anhydrase II (CA-II) Carbonic anhydrase II (hCA II) | Carbonic anhydrase isoenzyme II (hCA II)
Type:
Enzyme
Mol. Mass.:
29250.71
Organism:
Homo sapiens (Human)
Description:
P00918
Residue:
260
  
Inhibitor
Name:
BDBM50003247
Synonyms:
4-(4-Morpholin-4-ylmethyl-benzoyl)-thiophene-2-sulfonic acid amide; hydrochloride | CHEMBL545756
Type:
Small organic molecule
Emp. Form.:
C16H18N2O4S2
Mol. Mass.:
366.455
SMILES:
NS(=O)(=O)c1cc(cs1)C(=O)c1ccc(CN2CCOCC2)cc1
: