Target
Cysteinyl leukotriene receptor 1/2
Ligand
BDBM50230076
Substrate
Meas. Tech.
ChEBML_77048
IC50
>50000±n/a nM
Citation
 Zamboni, RBelley, MChampion, ECharette, LDeHaven, RFrenette, RGauthier, JYJones, TRLeger, SMasson, P Development of a novel series of styrylquinoline compounds as high-affinity leukotriene D4 receptor antagonists: synthetic and structure-activity studies leading to the discovery of (+-)-3-[[[3-[2-(7-chloro-2-quinolinyl)-(E)-ethenyl]phenyl][[3- (dimethylamino)-3-oxopropyl]thio]methyl]thio]propionic J Med Chem 35:3832-44 (1992)  
Target
Name:
Cysteinyl leukotriene receptor 1/2
Synonyms:
Cysteinyl leukotriene receptor
Type:
Mol. Mass.:
Description:
ASSAY_ID of ChEMBL is 98640
Components:
This complex has 2 components.
Component 1
Name:
Cysteinyl leukotriene receptor 1
Synonyms:
CLTR1_HUMAN CYSLTR1 Cysteinyl leukotriene receptor HG55 LTD4 receptor | Leukotriene Cysteinyl 1
Type:
Enzyme Catalytic Domain
Mol. Mass.:
38565.16
Organism:
Homo sapiens (Human)
Description:
Leukotriene Cysteinyl 1 CYSLTR1 HUMAN::Q9Y271
Residue:
337
  
Component 2
Name:
Cysteinyl leukotriene receptor 2
Synonyms:
CLTR2_HUMAN CYSLT2R Cysteinyl leukotriene receptor Leukotriene Cysteinyl 2
Type:
Enzyme Catalytic Domain
Mol. Mass.:
39657.52
Organism:
Homo sapiens (Human)
Description:
Leukotriene Cysteinyl 2 CYSLTR2 HUMAN::Q9NS75
Residue:
346
  
Inhibitor
Name:
BDBM50230076
Synonyms:
CHEMBL339304
Type:
Small organic molecule
Emp. Form.:
C17H13NO
Mol. Mass.:
247.2912
SMILES:
Oc1ccc(\C=C\c2ccc3ccccc3n2)cc1
: