Target
Cysteinyl leukotriene receptor 1
Ligand
BDBM50001271
Substrate
Meas. Tech.
ChEMBL_52046 (CHEMBL666432)
IC50
32±n/a nM
Citation
 Zamboni, RBelley, MChampion, ECharette, LDeHaven, RFrenette, RGauthier, JYJones, TRLeger, SMasson, P Development of a novel series of styrylquinoline compounds as high-affinity leukotriene D4 receptor antagonists: synthetic and structure-activity studies leading to the discovery of (+-)-3-[[[3-[2-(7-chloro-2-quinolinyl)-(E)-ethenyl]phenyl][[3- (dimethylamino)-3-oxopropyl]thio]methyl]thio]propionic J Med Chem 35:3832-44 (1992)  
Target
Name:
Cysteinyl leukotriene receptor 1
Synonyms:
CLTR1_CAVPO | CYSLTR1
Type:
Enzyme Catalytic Domain
Mol. Mass.:
39007.58
Organism:
GUINEA PIG
Description:
Leukotriene D4 0 GUINEA PIG::Q2NNR5
Residue:
340
  
Inhibitor
Name:
BDBM50001271
Synonyms:
3-((2-Carboxy-ethylsulfanyl)-{3-[2-(7-chloro-quinolin-2-yl)-cyclopropyl]-phenyl}-methylsulfanyl)-propionic acid | CHEMBL444331
Type:
Small organic molecule
Emp. Form.:
C25H24ClNO4S2
Mol. Mass.:
502.045
SMILES:
OC(=O)CCSC(SCCC(O)=O)c1cccc(c1)C1CC1c1ccc2ccc(Cl)cc2n1
: