Target
Beta-1 adrenergic receptor
Ligand
BDBM50002154
Substrate
Meas. Tech.
ChEBML_39323
Ki
500±n/a nM
Citation
 Meurer, LCTolman, RLChapin, EWSaperstein, RVicario, PPZrada, MMMacCoss, M Synthesis and hypoglycemic activity of substituted 8-(1-piperazinyl)imidazo[1,2-a]pyrazines. J Med Chem 35:3845-57 (1992)  
Target
Name:
Beta-1 adrenergic receptor
Synonyms:
ADRB1 adrenergic Beta1
Type:
Enzyme Catalytic Domain
Mol. Mass.:
50540.48
Organism:
GUINEA PIG
Description:
adrenergic Beta1 ADRB1 GUINEA PIG::B0FL73
Residue:
467
  
Inhibitor
Name:
BDBM50002154
Synonyms:
5-Bromo-8-(4-methyl-piperazin-1-yl)-imidazo[1,2-a]pyrazine | CHEMBL338704
Type:
Small organic molecule
Emp. Form.:
C11H14BrN5
Mol. Mass.:
296.166
SMILES:
CN1CCN(CC1)c1ncc(Br)n2ccnc12
: