Target
Beta-1 adrenergic receptor
Ligand
BDBM50002156
Substrate
Meas. Tech.
ChEBML_39323
Ki
310±n/a nM
Citation
 Meurer, LCTolman, RLChapin, EWSaperstein, RVicario, PPZrada, MMMacCoss, M Synthesis and hypoglycemic activity of substituted 8-(1-piperazinyl)imidazo[1,2-a]pyrazines. J Med Chem 35:3845-57 (1992)  
Target
Name:
Beta-1 adrenergic receptor
Synonyms:
ADRB1 adrenergic Beta1
Type:
Enzyme Catalytic Domain
Mol. Mass.:
50540.48
Organism:
GUINEA PIG
Description:
adrenergic Beta1 ADRB1 GUINEA PIG::B0FL73
Residue:
467
  
Inhibitor
Name:
BDBM50002156
Synonyms:
2-Methyl-8-piperazin-1-yl-imidazo[1,2-a]pyrazine; 2M.hydrochloride | CHEMBL544354
Type:
Small organic molecule
Emp. Form.:
C11H15N5
Mol. Mass.:
217.2703
SMILES:
Cc1cn2ccnc(N3CCNCC3)c2n1
: