Target
Alpha-2A adrenergic receptor
Ligand
BDBM50002150
Substrate
Meas. Tech.
ChEBML_33032
Ki
182±n/a nM
Citation
 Meurer, LCTolman, RLChapin, EWSaperstein, RVicario, PPZrada, MMMacCoss, M Synthesis and hypoglycemic activity of substituted 8-(1-piperazinyl)imidazo[1,2-a]pyrazines. J Med Chem 35:3845-57 (1992)  
Target
Name:
Alpha-2A adrenergic receptor
Synonyms:
ADA2A_BOVIN Alpha-2A adrenergic receptor Alpha-2A adrenoreceptor Alpha-2D adrenergic receptor Cerebral cortex alpha adrenergic receptor adrenergic Alpha2D
Type:
Enzyme Catalytic Domain
Mol. Mass.:
49275.13
Organism:
BOVINE
Description:
adrenergic Alpha2 0 BOVINE::Q28838
Residue:
452
  
Inhibitor
Name:
BDBM50002150
Synonyms:
5-Bromo-8-piperazin-1-yl-imidazo[1,2-a]pyrazine | CHEMBL123566
Type:
Small organic molecule
Emp. Form.:
C10H12BrN5
Mol. Mass.:
282.14
SMILES:
Brc1cnc(N2CCNCC2)c2nccn12
: