Target
Alpha-2A adrenergic receptor
Ligand
BDBM50002157
Substrate
Meas. Tech.
ChEBML_33032
Ki
11860±n/a nM
Citation
 Meurer, LCTolman, RLChapin, EWSaperstein, RVicario, PPZrada, MMMacCoss, M Synthesis and hypoglycemic activity of substituted 8-(1-piperazinyl)imidazo[1,2-a]pyrazines. J Med Chem 35:3845-57 (1992)  
Target
Name:
Alpha-2A adrenergic receptor
Synonyms:
ADA2A_BOVIN Alpha-2A adrenergic receptor Alpha-2A adrenoreceptor Alpha-2D adrenergic receptor Cerebral cortex alpha adrenergic receptor adrenergic Alpha2D
Type:
Enzyme Catalytic Domain
Mol. Mass.:
49275.13
Organism:
BOVINE
Description:
adrenergic Alpha2 0 BOVINE::Q28838
Residue:
452
  
Inhibitor
Name:
BDBM50002157
Synonyms:
3,5-Dibromo-8-piperazin-1-yl-imidazo[1,2-a]pyrazine | CHEMBL124926
Type:
Small organic molecule
Emp. Form.:
C10H11Br2N5
Mol. Mass.:
361.036
SMILES:
Brc1cnc2c(ncc(Br)n12)N1CCNCC1
: