Target
Vasopressin V2 receptor
Ligand
BDBM50406698
Substrate
Meas. Tech.
ChEBML_211249
IC50
1300±n/a nM
Citation
 Williams, PDBock, MGTung, RDGarsky, VMPerlow, DSErb, JMLundell, GFGould, NPWhitter, WLHoffman, JB Development of a novel class of cyclic hexapeptide oxytocin antagonists based on a natural product. J Med Chem 35:3905-18 (1992)  
Target
Name:
Vasopressin V2 receptor
Synonyms:
AVPR V2 Avpr2 V2R_RAT Vasopressin receptor
Type:
G-protein coupled receptor
Mol. Mass.:
40761.85
Organism:
Rattus norvegicus (Rat)
Description:
Residue:
371
  
Inhibitor
Name:
BDBM50406698
Synonyms:
CHEMBL2112247
Type:
Small organic molecule
Emp. Form.:
C41H55N9O6
Mol. Mass.:
769.9321
SMILES:
CC[C@H](C)[C@@H]1NC(=O)[C@@H](Cc2cn(C)c3ccccc23)NC(=O)[C@@H]2CCCN2C(=O)[C@@H](Cc2cnc[nH]2)NC(=O)[C@@H]2CCCCN2C(=O)[C@H]2CCCCN2C1=O
: