Target
Oxytocin receptor
Ligand
BDBM50406697
Substrate
Meas. Tech.
ChEBML_149178
IC50
8.3±n/a nM
Citation
 Williams, PDBock, MGTung, RDGarsky, VMPerlow, DSErb, JMLundell, GFGould, NPWhitter, WLHoffman, JB Development of a novel class of cyclic hexapeptide oxytocin antagonists based on a natural product. J Med Chem 35:3905-18 (1992)  
Target
Name:
Oxytocin receptor
Synonyms:
OT-R Otr Oxytocin
Type:
Enzyme Catalytic Domain
Mol. Mass.:
42889.28
Organism:
RAT
Description:
Oxytocin OXTR RAT::P70536
Residue:
388
  
Inhibitor
Name:
BDBM50406697
Synonyms:
CHEMBL2112250
Type:
Small organic molecule
Emp. Form.:
C42H54N8O6
Mol. Mass.:
766.9282
SMILES:
CC[C@H](C)[C@@H]1NC(=O)[C@@H](Cc2cccc3ccccc23)NC(=O)[C@@H]2CCCN2C(=O)[C@@H](Cc2cnc[nH]2)NC(=O)[C@@H]2CCCCN2C(=O)[C@H]2CCCCN2C1=O
: