Target
Oxytocin receptor
Ligand
BDBM50001301
Substrate
Meas. Tech.
ChEBML_149178
IC50
660±n/a nM
Citation
 Williams, PDBock, MGTung, RDGarsky, VMPerlow, DSErb, JMLundell, GFGould, NPWhitter, WLHoffman, JB Development of a novel class of cyclic hexapeptide oxytocin antagonists based on a natural product. J Med Chem 35:3905-18 (1992)  
Target
Name:
Oxytocin receptor
Synonyms:
OT-R Otr Oxytocin
Type:
Enzyme Catalytic Domain
Mol. Mass.:
42889.28
Organism:
RAT
Description:
Oxytocin OXTR RAT::P70536
Residue:
388
  
Inhibitor
Name:
BDBM50001301
Synonyms:
14,22-dibenzyl-23-methyl-11-(1-methyl-(1S)-propyl)-(5aR,11S,14R,16aS,22R,24aS)-perhydrotripyrrolo[1,2-a:1,2-d:1,2-j][1,4,7,10,13,16]hexaazacyclooctadecine-5,10,13,16,21,24-hexaone | CHEMBL129089
Type:
Small organic molecule
Emp. Form.:
C43H58N6O6
Mol. Mass.:
754.9572
SMILES:
CC[C@H](C)[C@@H]1NC(=O)[C@@H](Cc2ccccc2)NC(=O)[C@@H]2CCCCN2C(=O)[C@@H](Cc2ccccc2)N(C)C(=O)[C@@H]2CCCCN2C(=O)[C@H]2CCCCN2C1=O
: