Target
Oxytocin receptor
Ligand
BDBM50001315
Substrate
Meas. Tech.
ChEBML_149178
IC50
160±n/a nM
Citation
 Williams, PDBock, MGTung, RDGarsky, VMPerlow, DSErb, JMLundell, GFGould, NPWhitter, WLHoffman, JB Development of a novel class of cyclic hexapeptide oxytocin antagonists based on a natural product. J Med Chem 35:3905-18 (1992)  
Target
Name:
Oxytocin receptor
Synonyms:
OT-R Otr Oxytocin
Type:
Enzyme Catalytic Domain
Mol. Mass.:
42889.28
Organism:
RAT
Description:
Oxytocin OXTR RAT::P70536
Residue:
388
  
Inhibitor
Name:
BDBM50001315
Synonyms:
18-(4-Amino-butyl)-6,15-dibenzyl-3-sec-butyl-16-methyl-1,4,7,13,16,19-hexaaza-tricyclo[19.4.0.0*9,13*]pentacosane-2,5,8,14,17,20-hexaone | CHEMBL338294
Type:
Small organic molecule
Emp. Form.:
C42H59N7O6
Mol. Mass.:
757.9612
SMILES:
CC[C@H](C)[C@@H]1NC(=O)[C@@H](Cc2ccccc2)NC(=O)[C@@H]2CCCN2C(=O)[C@@H](Cc2ccccc2)N(C)C(=O)[C@H](CCCCN)NC(=O)[C@H]2CCCCN2C1=O
: