Target
Vasopressin V2 receptor
Ligand
BDBM50001311
Substrate
Meas. Tech.
ChEBML_211249
IC50
690±n/a nM
Citation
 Williams, PDBock, MGTung, RDGarsky, VMPerlow, DSErb, JMLundell, GFGould, NPWhitter, WLHoffman, JB Development of a novel class of cyclic hexapeptide oxytocin antagonists based on a natural product. J Med Chem 35:3905-18 (1992)  
Target
Name:
Vasopressin V2 receptor
Synonyms:
AVPR V2 Avpr2 V2R_RAT Vasopressin receptor
Type:
G-protein coupled receptor
Mol. Mass.:
40761.85
Organism:
Rattus norvegicus (Rat)
Description:
Residue:
371
  
Inhibitor
Name:
BDBM50001311
Synonyms:
24-benzyl-16-(1H-3-indolylmethyl)-25-methyl-13-[1-methyl-(1S)-propyl]-(6aR,13S,16R,18aS,24R,26aS)-perhydropyrazino[1,2-d]pyrido[1,2-a]pyrrolo[1,2-j][1,4,7,10,13,16]hexaazacyclooctadecine-6,12,15,18,23,26-hexaone | CHEMBL435021
Type:
Small organic molecule
Emp. Form.:
C43H56N8O6
Mol. Mass.:
780.9547
SMILES:
CC[C@H](C)[C@@H]1NC(=O)[C@@H](Cc2c[nH]c3ccccc23)NC(=O)[C@@H]2CCCN2C(=O)[C@@H](Cc2ccccc2)N(C)C(=O)[C@@H]2CNCCN2C(=O)[C@H]2CCCCN2C1=O
: