Target
Oxytocin receptor
Ligand
BDBM50001303
Substrate
Meas. Tech.
ChEBML_149178
IC50
25±n/a nM
Citation
 Williams, PDBock, MGTung, RDGarsky, VMPerlow, DSErb, JMLundell, GFGould, NPWhitter, WLHoffman, JB Development of a novel class of cyclic hexapeptide oxytocin antagonists based on a natural product. J Med Chem 35:3905-18 (1992)  
Target
Name:
Oxytocin receptor
Synonyms:
OT-R Otr Oxytocin
Type:
Enzyme Catalytic Domain
Mol. Mass.:
42889.28
Organism:
RAT
Description:
Oxytocin OXTR RAT::P70536
Residue:
388
  
Inhibitor
Name:
BDBM50001303
Synonyms:
18-(3-Amino-propyl)-15-benzyl-3-sec-butyl-6-(1H-indol-3-ylmethyl)-16-methyl-1,4,7,13,16,19,25-heptaaza-tricyclo[19.4.0.0*9,13*]pentacos-24-ene-2,5,8,14,17,20-hexaone | CHEMBL126765
Type:
Small organic molecule
Emp. Form.:
C42H55N9O6
Mol. Mass.:
781.9428
SMILES:
CC[C@H](C)[C@@H]1NC(=O)[C@@H](Cc2c[nH]c3ccccc23)NC(=O)[C@@H]2CCCN2C(=O)[C@@H](Cc2ccccc2)N(C)C(=O)[C@H](CCCN)NC(=O)[C@H]2CCC=NN2C1=O
: