Target
Substance-K receptor
Ligand
BDBM50001452
Substrate
Meas. Tech.
ChEBML_208846
IC50
>10000±n/a nM
Citation
 Harbeson, SLShatzer, SALe, TBBuck, SH A new class of high affinity ligands for the neurokinin A NK2 receptor: psi (CH2NR) reduced peptide bond analogues of neurokinin A4-10. J Med Chem 35:3949-55 (1992)  
Target
Name:
Substance-K receptor
Synonyms:
NK2R_MESAU Neurokinin NK2 TACR2
Type:
Enzyme Catalytic Domain
Mol. Mass.:
43436.75
Organism:
HAMSTER
Description:
P51144
Residue:
384
  
Inhibitor
Name:
BDBM50001452
Synonyms:
3-Amino-N-(2-{1-[1-({[1-(1-carbamoyl-3-methyl-butylcarbamoyl)-3-methyl-butylcarbamoyl]-methyl}-carbamoyl)-2-methyl-propylcarbamoyl]-2-phenyl-ethylamino}-1-hydroxymethyl-ethyl)-succinamic acid | CHEMBL409334
Type:
Small organic molecule
Emp. Form.:
C35H58N8O9
Mol. Mass.:
734.8832
SMILES:
CC(C)C[C@H](NC(=O)[C@H](CC(C)C)NC(=O)CNC(=O)[C@@H](NC(=O)[C@H](Cc1ccccc1)NC[C@H](CO)NC(=O)[C@@H](N)CC(O)=O)C(C)C)C(N)=O
: