Target
Substance-K receptor
Ligand
BDBM50001444
Substrate
Meas. Tech.
ChEBML_208846
IC50
162±n/a nM
Citation
 Harbeson, SLShatzer, SALe, TBBuck, SH A new class of high affinity ligands for the neurokinin A NK2 receptor: psi (CH2NR) reduced peptide bond analogues of neurokinin A4-10. J Med Chem 35:3949-55 (1992)  
Target
Name:
Substance-K receptor
Synonyms:
NK2R_MESAU Neurokinin NK2 TACR2
Type:
Enzyme Catalytic Domain
Mol. Mass.:
43436.75
Organism:
HAMSTER
Description:
P51144
Residue:
384
  
Inhibitor
Name:
BDBM50001444
Synonyms:
3-Amino-N-{1-[1-(1-{[(1-{[(1-carbamoyl-3-methyl-butyl)-(3-methyl-butyryl)-amino]-methyl}-3-methyl-butylcarbamoyl)-methyl]-carbamoyl}-2-methyl-propylcarbamoyl)-2-phenyl-ethylcarbamoyl]-2-hydroxy-ethyl}-succinamic acid | CHEMBL129301
Type:
Small organic molecule
Emp. Form.:
C40H66N8O10
Mol. Mass.:
818.9996
SMILES:
CC(C)C[C@@H](CN([C@@H](CC(C)C)C(N)=O)C(=O)CC(C)C)NC(=O)CNC(=O)[C@@H](NC(=O)[C@H](Cc1ccccc1)NC(=O)[C@H](CO)NC(=O)[C@@H](N)CC(O)=O)C(C)C
: