Target
Platelet-activating factor receptor
Ligand
BDBM50003509
Substrate
Meas. Tech.
ChEBML_154975
IC50
260±n/a nM
Citation
 Carceller, EAlmansa, CMerlos, MGiral, MBartrolí, JGarcía-Rafanell, JForn, J (Pyridylcyanomethyl)piperazines as orally active PAF antagonists. J Med Chem 35:4118-34 (1992)  
Target
Name:
Platelet-activating factor receptor
Synonyms:
PAF-R PTAFR_CAVPO Platelet-activating factor receptor
Type:
Protein
Mol. Mass.:
39005.63
Organism:
Cavia porcellus
Description:
Residue:
342
  
Inhibitor
Name:
BDBM50003509
Synonyms:
CHEMBL335556 | [4-(4-Phenyl-butyryl)-piperazin-1-yl]-pyridin-3-yl-acetonitrile; hydrate
Type:
Small organic molecule
Emp. Form.:
C21H24N4O
Mol. Mass.:
348.4415
SMILES:
O=C(CCCc1ccccc1)N1CCN(CC1)C(C#N)c1cccnc1
: