Target
Platelet-activating factor receptor
Ligand
BDBM50003517
Substrate
Meas. Tech.
ChEBML_154975
IC50
520±n/a nM
Citation
 Carceller, EAlmansa, CMerlos, MGiral, MBartrolí, JGarcía-Rafanell, JForn, J (Pyridylcyanomethyl)piperazines as orally active PAF antagonists. J Med Chem 35:4118-34 (1992)  
Target
Name:
Platelet-activating factor receptor
Synonyms:
PAF-R PTAFR_CAVPO Platelet-activating factor receptor
Type:
Protein
Mol. Mass.:
39005.63
Organism:
Cavia porcellus
Description:
Residue:
342
  
Inhibitor
Name:
BDBM50003517
Synonyms:
CHEMBL3215980 | [4-(3-Phenyl-propionyl)-piperazin-1-yl]-pyridin-3-yl-acetonitrile; dihydrochloride; hydrate
Type:
Small organic molecule
Emp. Form.:
C20H24Cl2N4O
Mol. Mass.:
407.337
SMILES:
Cl.Cl.O=C(CCc1ccccc1)N1CCN(CC1)C(C#N)c1cccnc1
: