Target
Platelet-activating factor receptor
Ligand
BDBM50003482
Substrate
Meas. Tech.
ChEBML_154975
IC50
11000±n/a nM
Citation
 Carceller, EAlmansa, CMerlos, MGiral, MBartrolí, JGarcía-Rafanell, JForn, J (Pyridylcyanomethyl)piperazines as orally active PAF antagonists. J Med Chem 35:4118-34 (1992)  
Target
Name:
Platelet-activating factor receptor
Synonyms:
PAF-R PTAFR_CAVPO Platelet-activating factor receptor
Type:
Protein
Mol. Mass.:
39005.63
Organism:
Cavia porcellus
Description:
Residue:
342
  
Inhibitor
Name:
BDBM50003482
Synonyms:
CHEMBL132246 | [4-(3,3-Diphenyl-propionyl)-piperazin-1-yl]-(3-nitro-phenyl)-acetonitrile
Type:
Small organic molecule
Emp. Form.:
C27H26N4O3
Mol. Mass.:
454.5203
SMILES:
[O-][N+](=O)c1cccc(c1)C(C#N)N1CCN(CC1)C(=O)CC(c1ccccc1)c1ccccc1
: