Target
Adenosine receptor A1
Ligand
BDBM50368457
Substrate
Meas. Tech.
ChEMBL_28979 (CHEMBL640781)
Ki
1820±n/a nM
Citation
 Jacobson, KANikodijevic, OJi, XDBerkich, DAEveleth, DDean, RLHiramatsu, KKassell, NFvan Galen, PJLee, KS Synthesis and biological activity of N6-(p-sulfophenyl)alkyl and N6-sulfoalkyl derivatives of adenosine: water-soluble and peripherally selective adenosine agonists. J Med Chem 35:4143-9 (1992)  
Target
Name:
Adenosine receptor A1
Synonyms:
AA1R_RAT ADENOSINE A1 high Adenosine A1 receptor (A1) Adenosine receptors A1 | Adora1
Type:
Protein
Mol. Mass.:
36704.13
Organism:
Rattus norvegicus (rat)
Description:
Residue:
326
  
Inhibitor
Name:
BDBM50368457
Synonyms:
CHEMBL1788287
Type:
Small organic molecule
Emp. Form.:
C9H12IN
Mol. Mass.:
261.1028
SMILES:
C[C@H](N)Cc1ccc(I)cc1
: