Target
Adenosine deaminase
Ligand
BDBM22925
Substrate
Meas. Tech.
ChEMBL_30785 (CHEMBL645062)
Ki
0.002500±n/a nM
Citation
 Harriman, GCPoirot, AFAbushanab, EMidgett, RMStoeckler, JD Adenosine deaminase inhibitors. Synthesis and biological evaluation of C1' and nor-C1' derivatives of (+)-erythro-9-(2(S)-hydroxy-3(R)-nonyl)adenine. J Med Chem 35:4180-4 (1992)  
Target
Name:
Adenosine deaminase
Synonyms:
ADA Adenosine aminohydrolase
Type:
Enzyme
Mol. Mass.:
40910.44
Organism:
Bos taurus (bovine)
Description:
Residue:
363
  
Inhibitor
Name:
BDBM22925
Synonyms:
(8R)-3-[(2R,4S,5R)-4-hydroxy-5-(hydroxymethyl)oxolan-2-yl]-3H,6H,7H,8H-imidazo[4,5-d][1,3]diazepin-8-ol Deoxycoformycin Pentostatin
Type:
Nucleoside or nucleotide
Emp. Form.:
C11H16N4O4
Mol. Mass.:
268.2691
SMILES:
OC[C@H]1O[C@H](C[C@@H]1O)n1cnc2[C@H](O)CNC=Nc12
: