Target
Adenosine deaminase
Ligand
BDBM50003607
Substrate
Meas. Tech.
ChEMBL_30785 (CHEMBL645062)
Ki
1300±n/a nM
Citation
 Harriman, GCPoirot, AFAbushanab, EMidgett, RMStoeckler, JD Adenosine deaminase inhibitors. Synthesis and biological evaluation of C1' and nor-C1' derivatives of (+)-erythro-9-(2(S)-hydroxy-3(R)-nonyl)adenine. J Med Chem 35:4180-4 (1992)  
Target
Name:
Adenosine deaminase
Synonyms:
ADA Adenosine aminohydrolase
Type:
Enzyme
Mol. Mass.:
40910.44
Organism:
Bos taurus (bovine)
Description:
Residue:
363
  
Inhibitor
Name:
BDBM50003607
Synonyms:
9-(1-Azidomethyl-heptyl)-9H-purin-6-ylamine | CHEMBL423163
Type:
Small organic molecule
Emp. Form.:
C13H20N8
Mol. Mass.:
288.3515
SMILES:
CCCCCC[C@H](CN=[N+]=[N-])n1cnc2c(N)ncnc12
: