Target
Substance-P receptor
Ligand
BDBM50001596
Substrate
Meas. Tech.
ChEBML_205400
EC50
44±n/a nM
Citation
 Deal, MJHagan, RMIreland, SJJordan, CCMcElroy, ABPorter, BRoss, BCStephens-Smith, MWard, P Conformationally constrained tachykinin analogues: potent and highly selective neurokinin NK-2 receptor agonists. J Med Chem 35:4195-204 (1992)  
Target
Name:
Substance-P receptor
Synonyms:
NK1R_CAVPO Neurokinin NK1 TACR1
Type:
Enzyme Catalytic Domain
Mol. Mass.:
46261.42
Organism:
GUINEA PIG
Description:
Neurokinin NK1 TACR1 GUINEA PIG::P30547
Residue:
407
  
Inhibitor
Name:
BDBM50001596
Synonyms:
3-(2-Acetylamino-6-amino-hexanoylamino)-N-{1-[1-(1-{1-[1-(1-carbamoyl-3-methylsulfanyl-propylcarbamoyl)-3-methyl-butyl]-2-oxo-pyrrolidin-3-ylcarbamoyl}-2-methyl-propylcarbamoyl)-2-phenyl-ethylcarbamoyl]-2-hydroxy-ethyl}-succinamic acid | CHEMBL134091
Type:
Small organic molecule
Emp. Form.:
C44H70N10O12S
Mol. Mass.:
963.151
SMILES:
CSCC[C@H](NC(=O)[C@H](CC(C)C)N1CCC(NC(=O)[C@@H](NC(=O)[C@H](Cc2ccccc2)NC(=O)[C@H](CO)NC(=O)[C@H](CC(O)=O)NC(=O)[C@H](CCCCN)NC(C)=O)C(C)C)C1=O)C(N)=O
: