Target
Substance-P receptor
Ligand
BDBM50001599
Substrate
Meas. Tech.
ChEBML_205400
EC50
545±n/a nM
Citation
 Deal, MJHagan, RMIreland, SJJordan, CCMcElroy, ABPorter, BRoss, BCStephens-Smith, MWard, P Conformationally constrained tachykinin analogues: potent and highly selective neurokinin NK-2 receptor agonists. J Med Chem 35:4195-204 (1992)  
Target
Name:
Substance-P receptor
Synonyms:
NK1R_CAVPO Neurokinin NK1 TACR1
Type:
Enzyme Catalytic Domain
Mol. Mass.:
46261.42
Organism:
GUINEA PIG
Description:
Neurokinin NK1 TACR1 GUINEA PIG::P30547
Residue:
407
  
Inhibitor
Name:
BDBM50001599
Synonyms:
2-(1-{2-[2-(5-Amino-pentanoylamino)-3-phenyl-propionylamino]-3-phenyl-propionyl}-6-oxo-hexahydro-pyrrolo[3,4-b]pyrrol-5-yl)-4-methyl-pentanoic acid (1-carbamoyl-3-methylsulfanyl-propyl)-amide | CHEMBL134012
Type:
Small organic molecule
Emp. Form.:
C40H57N7O6S
Mol. Mass.:
763.989
SMILES:
CSCC[C@H](NC(=O)[C@H](CC(C)C)N1C[C@H]2CCN([C@H]2C1=O)C(=O)[C@H](Cc1ccccc1)NC(=O)[C@H](Cc1ccccc1)NC(=O)CCCCN)C(N)=O
: