Target
Neuromedin-K receptor
Ligand
BDBM50001595
Substrate
Meas. Tech.
ChEBML_209701
EC50
>10000±n/a nM
Citation
 Deal, MJHagan, RMIreland, SJJordan, CCMcElroy, ABPorter, BRoss, BCStephens-Smith, MWard, P Conformationally constrained tachykinin analogues: potent and highly selective neurokinin NK-2 receptor agonists. J Med Chem 35:4195-204 (1992)  
Target
Name:
Neuromedin-K receptor
Synonyms:
NK3R_RAT Tac3r | Tacr3
Type:
Mol. Mass.:
51128.60
Organism:
Rattus norvegicus
Description:
ChEMBL_10983
Residue:
452
  
Inhibitor
Name:
BDBM50001595
Synonyms:
1-{2-[2-(5-Amino-pentanoylamino)-3-phenyl-propionylamino]-3-phenyl-propionyl}-pyrrolidine-2-carboxylic acid [1-(1-carbamoyl-3-methylsulfanyl-propylcarbamoyl)-3-methyl-butyl]-amide | CHEMBL407511
Type:
Small organic molecule
Emp. Form.:
C39H57N7O6S
Mol. Mass.:
751.978
SMILES:
CSCC[C@H](NC(=O)[C@H](CC(C)C)NC(=O)[C@@H]1CCCN1C(=O)[C@H](Cc1ccccc1)NC(=O)[C@H](Cc1ccccc1)NC(=O)CCCCN)C(N)=O
: