Target
Neuromedin-K receptor
Ligand
BDBM50001597
Substrate
Meas. Tech.
ChEBML_209701
EC50
857±n/a nM
Citation
 Deal, MJHagan, RMIreland, SJJordan, CCMcElroy, ABPorter, BRoss, BCStephens-Smith, MWard, P Conformationally constrained tachykinin analogues: potent and highly selective neurokinin NK-2 receptor agonists. J Med Chem 35:4195-204 (1992)  
Target
Name:
Neuromedin-K receptor
Synonyms:
NK3R_RAT Tac3r | Tacr3
Type:
Mol. Mass.:
51128.60
Organism:
Rattus norvegicus
Description:
ChEMBL_10983
Residue:
452
  
Inhibitor
Name:
BDBM50001597
Synonyms:
CHEMBL134481 | N-(1-{1-[1-({[1-(1-Carbamoyl-3-methylsulfanyl-propylcarbamoyl)-3-methyl-butylcarbamoyl]-methyl}-carbamoyl)-2-phenyl-ethylcarbamoyl]-2-phenyl-ethylcarbamoyl}-2-hydroxy-ethyl)-3-(2,6-diamino-hexanoylamino)-succinamic acid
Type:
Small organic molecule
Emp. Form.:
C44H66N10O11S
Mol. Mass.:
943.12
SMILES:
CSCC[C@H](NC(=O)[C@H](CC(C)C)NC(=O)CNC(=O)[C@H](Cc1ccccc1)NC(=O)[C@H](Cc1ccccc1)NC(=O)[C@H](CO)NC(=O)[C@H](CC(O)=O)NC(=O)[C@@H](N)CCCCN)C(N)=O
: