Target
Substance-K receptor
Ligand
BDBM50001605
Substrate
Meas. Tech.
ChEBML_209227
EC50
1190±n/a nM
Citation
 Deal, MJHagan, RMIreland, SJJordan, CCMcElroy, ABPorter, BRoss, BCStephens-Smith, MWard, P Conformationally constrained tachykinin analogues: potent and highly selective neurokinin NK-2 receptor agonists. J Med Chem 35:4195-204 (1992)  
Target
Name:
Substance-K receptor
Synonyms:
NK-2 receptor NK2R_RAT Neurokinin A receptor SKR Tac2r Tacr2
Type:
Enzyme Catalytic Domain
Mol. Mass.:
43868.63
Organism:
Rattus norvegicus (Rat)
Description:
Neurokinin NK2 TACR2 Murine::P16610
Residue:
390
  
Inhibitor
Name:
BDBM50001605
Synonyms:
2-(1-{2-[2-(5-Amino-pentanoylamino)-3-phenyl-propionylamino]-3-phenyl-propionyl}-6-oxo-hexahydro-pyrrolo[3,4-b]pyrrol-5-yl)-4-methyl-pentanoic acid (1-carbamoyl-3-methylsulfanyl-propyl)-amide | CHEMBL337465
Type:
Small organic molecule
Emp. Form.:
C40H57N7O6S
Mol. Mass.:
763.989
SMILES:
CSCC[C@H](NC(=O)[C@H](CC(C)C)N1C[C@@H]2CCN([C@@H]2C1=O)C(=O)[C@H](Cc1ccccc1)NC(=O)[C@H](Cc1ccccc1)NC(=O)CCCCN)C(N)=O
: