Target
Delta-type opioid receptor
Ligand
BDBM50001675
Substrate
Meas. Tech.
ChEBML_147290
Ki
11±n/a nM
Citation
 Portoghese, PSLarson, DLSultana, MTakemori, AE Opioid agonist and antagonist activities of morphindoles related to naltrindole. J Med Chem 35:4325-9 (1992)  
Target
Name:
Delta-type opioid receptor
Synonyms:
D-OR-1 Delta opioid receptor OPIATE Delta OPRD1 OPRK1 | opioid receptor, delta 1
Type:
G Protein-Coupled Receptor (GPCR)
Mol. Mass.:
40382.98
Organism:
Homo sapiens (Human)
Description:
Competition binding assays were carried out using membrane preparations from transfected HN9.10 cells that constitutively expressed the delta opioid receptor.
Residue:
372
  
Inhibitor
Name:
BDBM50001675
Synonyms:
14-oxa-11,22-diazaheptacyclo[13.9.1.01,13.02,21.04,12.05,10.019,25]pentacosa-4(12),5(10),6,8,15(25),16,18-heptaene-2,16-diol | CHEMBL285563
Type:
Small organic molecule
Emp. Form.:
C22H20N2O3
Mol. Mass.:
360.4058
SMILES:
Oc1ccc2CC3NCC[C@@]45[C@@H](Oc1c24)c1[nH]c2ccccc2c1C[C@@]35O
: