Target
Mu-type opioid receptor
Ligand
BDBM50001675
Substrate
Meas. Tech.
ChEMBL_145427 (CHEMBL747995)
Ki
>1000±n/a nM
Citation
 Portoghese, PSLarson, DLSultana, MTakemori, AE Opioid agonist and antagonist activities of morphindoles related to naltrindole. J Med Chem 35:4325-9 (1992)  
Target
Name:
Mu-type opioid receptor
Synonyms:
M-OR-1 Mu opioid receptor OPIATE Mu OPRM_CAVPO
Type:
Enzyme Catalytic Domain
Mol. Mass.:
11165.58
Organism:
GUINEA PIG
Description:
P97266
Residue:
98
  
Inhibitor
Name:
BDBM50001675
Synonyms:
14-oxa-11,22-diazaheptacyclo[13.9.1.01,13.02,21.04,12.05,10.019,25]pentacosa-4(12),5(10),6,8,15(25),16,18-heptaene-2,16-diol | CHEMBL285563
Type:
Small organic molecule
Emp. Form.:
C22H20N2O3
Mol. Mass.:
360.4058
SMILES:
Oc1ccc2CC3NCC[C@@]45[C@@H](Oc1c24)c1[nH]c2ccccc2c1C[C@@]35O
: