Target
Delta-type opioid receptor
Ligand
BDBM50221416
Substrate
Meas. Tech.
ChEBML_147290
Ki
0.700000±n/a nM
Citation
 Portoghese, PSLarson, DLSultana, MTakemori, AE Opioid agonist and antagonist activities of morphindoles related to naltrindole. J Med Chem 35:4325-9 (1992)  
Target
Name:
Delta-type opioid receptor
Synonyms:
D-OR-1 Delta opioid receptor OPIATE Delta OPRD1 OPRK1 | opioid receptor, delta 1
Type:
G Protein-Coupled Receptor (GPCR)
Mol. Mass.:
40382.98
Organism:
Homo sapiens (Human)
Description:
Competition binding assays were carried out using membrane preparations from transfected HN9.10 cells that constitutively expressed the delta opioid receptor.
Residue:
372
  
Inhibitor
Name:
BDBM50221416
Synonyms:
22-methyl-(2S,13R)-14-oxa-11,22-diazaheptacyclo[13.9.1.01,13.02,21.04,12.05,10.019,25]pentacosa-4(12),5(10),6,8,15(25),16,18-heptaene-2,16-diol(HCl0.5H2O) (Oxymorphindole, OMI) CHEMBL401093 | OXYMORPHINDOLE
Type:
Small organic molecule
Emp. Form.:
C23H22N2O3
Mol. Mass.:
374.4324
SMILES:
CN1CC[C@@]23[C@H]4Oc5c2c(C[C@@H]1[C@]3(O)Cc1c4[nH]c2ccccc12)ccc5O
: