Target
Delta-type opioid receptor
Ligand
BDBM50001678
Substrate
Meas. Tech.
ChEBML_147290
Ki
106±n/a nM
Citation
 Portoghese, PSLarson, DLSultana, MTakemori, AE Opioid agonist and antagonist activities of morphindoles related to naltrindole. J Med Chem 35:4325-9 (1992)  
Target
Name:
Delta-type opioid receptor
Synonyms:
D-OR-1 Delta opioid receptor OPIATE Delta OPRD1 OPRK1 | opioid receptor, delta 1
Type:
G Protein-Coupled Receptor (GPCR)
Mol. Mass.:
40382.98
Organism:
Homo sapiens (Human)
Description:
Competition binding assays were carried out using membrane preparations from transfected HN9.10 cells that constitutively expressed the delta opioid receptor.
Residue:
372
  
Inhibitor
Name:
BDBM50001678
Synonyms:
22-[3-phenyl-(E)-2-propenyl]-14-oxa-11,22-diazaheptacyclo[13.9.1.01,13.02,21.04,12.05,10.019,25]pentacosa-4(12),5(10),6,8,15(25),16,18-heptaen-16-ol
Type:
Small organic molecule
Emp. Form.:
C31H28N2O2
Mol. Mass.:
460.5662
SMILES:
Oc1ccc2CC3[C@@H]4Cc5c([nH]c6ccccc56)[C@@H]5Oc1c2[C@]45CCN3C\C=C\c1ccccc1
: