Target
Sigma non-opioid intracellular receptor 1
Ligand
BDBM50002263
Substrate
Meas. Tech.
ChEBML_201877
Ki
3±n/a nM
Citation
 Gilligan, PJCain, GAChristos, TECook, LDrummond, SJohnson, ALKergaye, AAMcElroy, JFRohrbach, KWSchmidt, WK Novel piperidine sigma receptor ligands as potential antipsychotic drugs. J Med Chem 35:4344-61 (1992)  
Target
Name:
Sigma non-opioid intracellular receptor 1
Synonyms:
Opioid receptor, sigma 1 SGMR1_MOUSE Sigma1-receptor Sigmar1
Type:
Enzyme Catalytic Domain
Mol. Mass.:
25246.51
Organism:
Mus musculus (Mouse)
Description:
O55242
Residue:
223
  
Inhibitor
Name:
BDBM50002263
Synonyms:
1-Cyclohexylmethyl-4-(4-fluoro-benzyloxymethyl)-piperidine; hydrochloride | CHEMBL542737
Type:
Small organic molecule
Emp. Form.:
C20H30FNO
Mol. Mass.:
319.4567
SMILES:
Fc1ccc(COCC2CCN(CC3CCCCC3)CC2)cc1
: